{"text_format":"1","workbook":"xlsx","n_sheets":6,"sheets":["APOYO CIUDADANO FED-LOCAL ","APOYO_CIUDADANO","PRECAMPAÑA FED-LOCAL ","PRECAMPAÑA","CAMPAÑA FED-LOCAL ","CAMPAÑA"],"not_rendered":{"charts":0,"images":3,"macros":0,"external_links":0,"defined_names":2,"comments":0,"pivot_tables":0},"unopened":[],"bounds":{"document_bytes":16777216,"sheet_cells":100000,"rows_first":2000,"rows_last":500,"rows_between":2000,"halvings":0,"cell_chars":16384,"cell_head_chars":4096},"cells_cut":0,"cells_raw":0,"read":"whole","date_system":"1900"}

{"sheet":"APOYO CIUDADANO FED-LOCAL ","index":0,"n_rows":188,"n_cols":14,"rows_kept":188,"cut":false,"hidden":true,"merged":[[1,3,1,7],[1,9,1,11],[182,4,182,5],[185,4,185,5],[187,4,187,5],[170,4,170,5],[173,4,173,5],[175,4,175,5],[178,4,178,5],[180,4,180,5],[157,4,157,5],[160,4,160,5],[162,4,162,5],[164,4,164,5],[167,4,167,5],[145,4,145,5],[147,4,147,5],[150,4,150,5],[152,4,152,5],[155,4,155,5],[132,4,132,5],[134,4,134,5],[137,4,137,5],[139,4,139,5],[142,4,142,5],[120,4,120,5],[122,4,122,5],[125,4,125,5],[127,4,127,5],[130,4,130,5],[108,4,108,5],[110,4,110,5],[113,4,113,5],[115,4,115,5],[117,4,117,5],[100,4,100,5],[103,4,103,5],[105,4,105,5],[88,4,88,5],[90,4,90,5],[93,4,93,5],[96,4,96,5],[98,4,98,5],[75,4,75,5],[78,4,78,5],[81,4,81,5],[83,4,83,5],[85,4,85,5],[64,4,64,5],[66,4,66,5],[68,4,68,5],[71,4,71,5],[73,4,73,5],[52,4,52,5],[54,4,54,5],[57,4,57,5],[59,4,59,5],[61,4,61,5],[39,4,39,5],[42,4,42,5],[44,4,44,5],[46,4,46,5],[49,4,49,5],[32,1,186,1],[6,1,29,1],[7,4,7,5],[9,4,9,5],[11,4,11,5],[14,4,14,5],[16,4,16,5],[18,4,18,5],[20,4,20,5],[22,4,22,5],[24,4,24,5],[26,4,26,5],[28,4,28,5],[30,4,30,5],[34,4,34,5],[37,4,37,5]]}
[]
[null,null,null,"ETAPAS DEL PROCESO DE FISCALIZACIÓN 2017-2018",null,null,null,null,null,"APOYO CIUDADANO"]
[]
[null,null,null,null,"INICIO APOYO CIUDADANO","FIN APOYO CIUDADANO","DIAS","PRESENTACIÓN DEL INFORME ","NOTIFICACIÓN DE ERRORES Y OMISIONES ","RESPUESTA AL OFICIO DE ERRORES Y OMISIONES ","ELABORACIÓN DE DICTAMEN ","APROBACIÓN DE LA COF ","PRESENTACIÓN AL CG ","APROBACIÓN DEL CONSEJO GENERAL"]
[null,null,null,null,"PLAZOS LEY PARTIDOS POLÍTICOS:",null,null,"10 DIAS","15 DIAS","7 DIAS","10 DIAS","6 DIAS","3 DIAS","6 DIAS"]
[null,null,null,null,"PLAZOS LEY ASPIRANTES:",null,null,"30 DÍAS","15 DIAS","7 DIAS","10 DIAS","6 DIAS","3 DIAS","6 DIAS"]
[null,"PROCESO ELECTORAL FEDERAL",null,"PRESIDENTE GPO 1","2017-10-16","2018-02-19",126,"2018-02-24","2018-03-05","2018-03-12","2018-03-19","2018-03-22","2018-03-25","2018-03-28"]
[null,null,{"$f":"D7&E8","v":"PRESIDENTE GPO 1Días para la notificación:"},null,"Días para la notificación:",null,null,5,9,7,7,3,3,3]
[null,null,null,"PRESIDENTE GPO 2","2017-10-19","2018-02-22",126,"2018-02-27","2018-03-05","2018-03-12","2018-03-19","2018-03-22","2018-03-25","2018-03-28"]
[null,null,{"$f":"D9&E10","v":"PRESIDENTE GPO 2Días para la notificación:"},null,"Días para la notificación:",null,null,5,6,7,7,3,3,3]
[null,null,null,"DIPUTADO GPO1","2017-10-06","2017-12-11",66,"2017-12-26","2018-01-10","2018-01-17","2018-01-29","2018-02-05","2018-02-08","2018-02-14"]
[null,null,{"$f":"D11&E12","v":"DIPUTADO GPO1Días para la notificación:"},null,"Días para la notificación:",null,null,15,15,7,12,7,3,6]
[]
[null,null,null,"DIPUTADO GPO2","2017-10-12","2017-12-17",66,"2017-12-26","2018-01-10","2018-01-17","2018-01-29","2018-02-05","2018-02-08","2018-02-14"]
[null,null,{"$f":"D14&E15","v":"DIPUTADO GPO2Días para la notificación:"},null,"Días para la notificación:",null,null,9,15,7,12,7,3,6]
{"$rows_left_out":174}
{"sheet":"APOYO_CIUDADANO","index":1,"n_rows":43,"n_cols":18,"rows_kept":43,"cut":false,"hidden":false,"merged":[[8,4,8,6],[16,4,16,6],[18,4,18,6],[20,4,20,6],[7,3,8,3]]}
[]
[5,"PROCESO DE FISCALIZACIÓN 2017 - 2018",null,null,null,null,null,null,"APOYO CIUDADANO FEDERAL",null,null,null,null,null,null,null,null,"PRESIDENTE GPO 1"]
[16,null,null,null,null,null,null,null,null,null,null,null,null,null,null,null,null,"PRESIDENTE GPO 2"]
[null,null,null,null,null,null,null,null,null,null,null,null,null,null,null,null,null,"DIPUTADO GPO1"]
[null,null,null,"CARGO Y GRUPO","INICIO APOYO CIUDADANO","FIN APOYO CIUDADANO","DIAS","PRESENTACIÓN DEL INFORME ","NOTIFICACIÓN DE ERRORES Y OMISIONES ","RESPUESTA AL OFICIO DE ERRORES Y OMISIONES ","ELABORACIÓN DE DICTAMEN ","APROBACIÓN DE LA COF ","CIRCULAR AL CG ","APROBACIÓN DEL CONSEJO GENERAL",null,null,null,"DIPUTADO GPO2"]
[null,null,null,null,"PLAZOS LEY PARTIDOS POLÍTICOS:",null,null,"10 DIAS","15 DIAS","7 DIAS","10 DIAS","6 DIAS","3 DIAS","6 DIAS",null,null,null,"DIPUTADO GPO3"]
[null,null,null,null,"PLAZOS LEY ASPIRANTES:",null,null,"30 DÍAS","15 DIAS","7 DIAS","10 DIAS","6 DIAS","3 DIAS","6 DIAS",null,null,null,"DIPUTADO GPO4"]
[null,null,null,"PRESIDENTE GPO 1",{"$f":"VLOOKUP($D$8,'APOYO CIUDADANO FED-LOCAL '!$D$7:$N$30,2,0)","v":"2017-10-16"},{"$f":"VLOOKUP($D$8,'APOYO CIUDADANO FED-LOCAL '!$D$7:$N$30,3,0)","v":"2018-02-19"},{"$f":"VLOOKUP($D$8,'APOYO CIUDADANO FED-LOCAL '!$D$7:$N$30,4,0)","v":126},{"$f":"VLOOKUP($D$8,'APOYO CIUDADANO FED-LOCAL '!$D$7:$N$30,5,0)","v":"2018-02-24"},{"$f":"VLOOKUP($D$8,'APOYO CIUDADANO FED-LOCAL '!$D$7:$N$30,6,0)","v":"2018-03-05"},{"$f":"VLOOKUP($D$8,'APOYO CIUDADANO FED-LOCAL '!$D$7:$N$30,7,0)","v":"2018-03-12"},{"$f":"VLOOKUP($D$8,'APOYO CIUDADANO FED-LOCAL '!$D$7:$N$30,8,0)","v":"2018-03-19"},{"$f":"VLOOKUP($D$8,'APOYO CIUDADANO FED-LOCAL '!$D$7:$N$30,9,0)","v":"2018-03-22"},{"$f":"VLOOKUP($D$8,'APOYO CIUDADANO FED-LOCAL '!$D$7:$N$30,10,0)","v":"2018-03-25"},{"$f":"VLOOKUP($D$8,'APOYO CIUDADANO FED-LOCAL '!$D$7:$N$30,11,0)","v":"2018-03-28"},null,null,null,"DIPUTADO GPO5"]
[null,null,null,null,"Días para la notificación:",null,null,{"$f":"VLOOKUP($D$8&$E$9,'APOYO CIUDADANO FED-LOCAL '!$C$8:$N$32,6,0)","v":5},{"$f":"VLOOKUP($D$8&$E$9,'APOYO CIUDADANO FED-LOCAL '!$C$8:$N$32,7,0)","v":9},{"$f":"VLOOKUP($D$8&$E$9,'APOYO CIUDADANO FED-LOCAL '!$C$8:$N$32,8,0)","v":7},{"$f":"VLOOKUP($D$8&$E$9,'APOYO CIUDADANO FED-LOCAL '!$C$8:$N$32,9,0)","v":7},{"$f":"VLOOKUP($D$8&$E$9,'APOYO CIUDADANO FED-LOCAL '!$C$8:$N$32,10,0)","v":3},{"$f":"VLOOKUP($D$8&$E$9,'APOYO CIUDADANO FED-LOCAL '!$C$8:$N$32,11,0)","v":3},{"$f":"VLOOKUP($D$8&$E$9,'APOYO CIUDADANO FED-LOCAL '!$C$8:$N$32,12,0)","v":3},null,null,null,"DIPUTADO GPO6"]
[null,null,null,null,null,null,null,null,null,null,null,null,null,null,null,null,null,"SENADOR GPO1"]
[null,null,null,null,null,null,null,null,null,null,null,null,null,null,null,null,null,"SENADOR GPO2"]
[null,"PROCESO DE FISCALIZACIÓN 2017 - 2018",null,null,null,null,null,null,"APOYO CIUDADANO LOCAL",null,null,null,null,null,null,null,null,"SENADOR GPO3"]
[null,null,null,null,null,null,null,null,null,null,null,null,null,null,null,null,null,"SENADOR GPO4"]
[null,null,null,null,null,null,null,null,null,null,null,null,null,null,null,null,null,"AGUASCALIENTES"]
[null,null,null,"AGUASCALIENTES","INICIO APOYO CIUDADANO","FIN APOYO CIUDADANO","DIAS","PRESENTACIÓN DEL INFORME ","NOTIFICACIÓN DE ERRORES Y OMISIONES ","RESPUESTA AL OFICIO DE ERRORES Y OMISIONES ","ELABORACIÓN DE DICTAMEN ","APROBACIÓN DE LA COF ","CIRCULAR AL CG ","APROBACIÓN DEL CONSEJO GENERAL",null,null,null,"BAJA CALIFORNIA SUR"]
{"$rows_left_out":29}
{"sheet":"PRECAMPAÑA FED-LOCAL ","index":2,"n_rows":168,"n_cols":14,"rows_kept":168,"cut":false,"hidden":true,"merged":[[164,3,164,5],[1,9,1,11],[9,1,161,1],[1,3,1,7],[153,4,153,5],[155,4,155,5],[157,4,157,5],[160,4,160,5],[127,4,127,5],[130,4,130,5],[132,4,132,5],[135,4,135,5],[137,4,137,5],[114,4,114,5],[117,4,117,5],[120,4,120,5],[122,4,122,5],[162,4,162,5],[139,4,139,5],[142,4,142,5],[145,4,145,5],[148,4,148,5],[150,4,150,5],[125,4,125,5],[102,4,102,5],[105,4,105,5],[107,4,107,5],[109,4,109,5],[112,4,112,5],[90,4,90,5],[92,4,92,5],[95,4,95,5],[97,4,97,5],[100,4,100,5],[78,4,78,5],[80,4,80,5],[83,4,83,5],[85,4,85,5],[88,4,88,5],[71,4,71,5],[73,4,73,5],[75,4,75,5],[58,4,58,5],[60,4,60,5],[63,4,63,5],[65,4,65,5],[68,4,68,5],[46,4,46,5],[48,4,48,5],[50,4,50,5],[53,4,53,5],[56,4,56,5],[34,4,34,5],[36,4,36,5],[38,4,38,5],[41,4,41,5],[43,4,43,5],[3,4,4,4],[3,5,4,5],[3,6,4,6],[6,4,6,5],[11,4,11,5],[26,4,26,5],[29,4,29,5],[31,4,31,5],[14,4,14,5],[16,4,16,5],[19,4,19,5],[21,4,21,5],[23,4,23,5]]}
[]
[null,null,null,"ETAPAS DEL PROCESO DE FISCALIZACIÓN 2017-2018",null,null,null,null,null,"PRECAMPAÑA"]
[]
[null,null,null,null,"INICIO PRECAMPAÑA","FIN PRECAMPAÑA","DIAS","PRESENTACIÓN DEL INFORME ","NOTIFICACIÓN DE ERRORES Y OMISIONES ","RESPUESTA AL OFICIO DE ERRORES Y OMISIONES ","ELABORACIÓN DE DICTAMEN ","APROBACIÓN DE LA COF ","PRESENTACIÓN AL CG ","APROBACIÓN DEL CONSEJO GENERAL"]
[null,null,1,null,null,null,null,"5 DIAS","15 DIAS","7 DIAS","10 DIAS","6 DIAS","3 DIAS","6 DIAS"]
[null,"FEDERAL",2,"PRESIDENTE, DIPUTADOS, SENADORES.","2017-12-14","2018-02-11",59,"2018-02-16","2018-02-28","2018-03-07","2018-03-17","2018-03-19","2018-03-20","2018-03-23"]
[null,null,3,null,"Días para la notificación:",null,null,5,12,7,10,2,1,3]
[]
[]
[null,"P R O C E S O     E L E C T O R A L    L O C A L",null,"AGUASCALIENTES"]
[null,null,"AGUASCALIENTES1","18 DIPUTADOS MR","2018-01-13","2018-02-11",29,"2018-02-16","2018-03-03","2018-03-10","2018-03-20","2018-03-26","2018-03-29","2018-04-04"]
[null,null,{"$f":"C11&E12&1","v":"AGUASCALIENTES1Días para la notificación:1"},null,"Días para la notificación:",null,null,5,15,7,10,6,3,6]
[null,null,null,"BAJA CALIFORNIA SUR"]
[null,null,"BAJA CALIFORNIA SUR1","16 DIPUTADOS MR","2018-01-03","2018-02-11",39,"2018-02-16","2018-03-03","2018-03-10","2018-03-20","2018-03-26","2018-03-29","2018-04-04"]
[null,null,{"$f":"C14&E15&1","v":"BAJA CALIFORNIA SUR1Días para la notificación:1"},null,"Días para la notificación:",null,null,5,15,7,10,6,3,6]
{"$rows_left_out":154}
{"sheet":"PRECAMPAÑA","index":3,"n_rows":29,"n_cols":18,"rows_kept":29,"cut":false,"hidden":false,"merged":[[11,4,12,4],[11,5,12,5],[11,6,12,6],[3,3,4,3],[3,4,4,4],[3,5,4,5],[3,6,4,6],[6,3,6,5],[25,4,25,6],[14,4,14,6],[16,4,16,6],[18,4,18,6],[20,4,20,6]]}
[null,null,null,null,null,null,null,null,null,null,null,null,null,null,null,null,null,"AGUASCALIENTES"]
[1,"PROCESO DE FISCALIZACIÓN 2017 - 2018",null,null,null,null,null,null,"PRECAMPAÑA FEDERAL",null,null,null,null,null,null,null,null,"BAJA CALIFORNIA SUR"]
[25,null,null,null,null,null,null,null,null,null,null,null,null,null,null,null,null,"CAMPECHE"]
[null,null,null,"CARGO","INICIO PRECAMPAÑA","FIN PRECAMPAÑA","DIAS","PRESENTACIÓN DEL INFORME ","NOTIFICACIÓN DE ERRORES Y OMISIONES ","RESPUESTA AL OFICIO DE ERRORES Y OMISIONES ","ELABORACIÓN DE DICTAMEN ","APROBACIÓN DE LA COF ","CIRCULAR AL CG ","APROBACIÓN DEL CONSEJO GENERAL",null,null,null,"CHIAPAS"]
[null,null,null,"CARGO Y GRUPO",null,null,null,"5 DIAS","15 DIAS","7 DIAS","10 DIAS","6 DIAS","3 DIAS","6 DIAS",null,null,null,"CHIHUAHUA"]
[null,"FEDERAL",null,"PRESIDENTE, DIPUTADOS, SENADORES.","2017-12-14","2018-02-11",59,"2018-02-16","2018-02-28","2018-03-07","2018-03-17","2018-03-19","2018-03-20","2018-03-23",null,null,null,"CIUDAD DE MÉXICO"]
[null,null,null,"Dias para la notificación",null,null,null,5,12,7,10,2,1,3,null,null,null,"COAHUILA"]
[null,null,null,null,null,null,null,null,null,null,null,null,null,null,null,null,null,"COLIMA"]
[null,null,null,null,null,null,null,null,null,null,null,null,null,null,null,null,null,"DURANGO"]
[null,"PROCESO DE FISCALIZACIÓN 2017 - 2018",null,null,null,null,null,null,"PRECAMPAÑA LOCAL",null,null,null,null,null,null,null,null,"ESTADO DE MÉXICO"]
[null,null,null,null,null,null,null,null,null,null,null,null,null,null,null,null,null,"GUANAJUATO"]
[null,null,null,"ENTIDAD","INICIO PRECAMPAÑA","FIN PRECAMPAÑA","DIAS","PRESENTACIÓN DEL INFORME ","NOTIFICACIÓN DE ERRORES Y OMISIONES ","RESPUESTA AL OFICIO DE ERRORES Y OMISIONES ","ELABORACIÓN DE DICTAMEN ","APROBACIÓN DE LA COF ","CIRCULAR AL CG ","APROBACIÓN DEL CONSEJO GENERAL",null,null,null,"GUERRERO"]
[null,"PROCESO ELECTORAL LOCAL",null,"BAJA CALIFORNIA SUR",null,null,null,"5 DIAS","15 DIAS","7 DIAS","10 DIAS","6 DIAS","3 DIAS","6 DIAS",null,null,null,"HIDALGO"]
[null,"25-1 GOBERNADOR",1,{"$f":"IFERROR(VLOOKUP($D$13&$C14,'PRECAMPAÑA FED-LOCAL '!$C$11:$N$164,2,0),\"\")","v":"16 DIPUTADOS MR"},{"$f":"IFERROR(VLOOKUP($D$13&$C14,'PRECAMPAÑA FED-LOCAL '!$C$11:$N$164,3,0),\"\")","v":"2018-01-03"},{"$f":"IFERROR(VLOOKUP($D$13&$C14,'PRECAMPAÑA FED-LOCAL '!$C$11:$N$164,4,0),\"\")","v":"2018-02-11"},{"$f":"IFERROR(VLOOKUP($D$13&$C14,'PRECAMPAÑA FED-LOCAL '!$C$11:$N$164,5,0),\"\")","v":39},{"$f":"IF(VLOOKUP($D$13&$C14,'PRECAMPAÑA FED-LOCAL '!$C$11:$N$164,6,0)=0,\"\",(VLOOKUP($D$13&$C14,'PRECAMPAÑA FED-LOCAL '!$C$11:$N$164,6,0)))","v":"2018-02-16"},{"$f":"IF(VLOOKUP($D$13&$C14,'PRECAMPAÑA FED-LOCAL '!$C$11:$N$164,7,0)=0,\"\",(VLOOKUP($D$13&$C14,'PRECAMPAÑA FED-LOCAL '!$C$11:$N$164,7,0)))","v":"2018-03-03"},{"$f":"IF(VLOOKUP($D$13&$C14,'PRECAMPAÑA FED-LOCAL '!$C$11:$N$164,8,0)=0,\"\",(VLOOKUP($D$13&$C14,'PRECAMPAÑA FED-LOCAL '!$C$11:$N$164,8,0)))","v":"2018-03-10"},{"$f":"IF(VLOOKUP($D$13&$C14,'PRECAMPAÑA FED-LOCAL '!$C$11:$N$164,9,0)=0,\"\",(VLOOKUP($D$13&$C14,'PRECAMPAÑA FED-LOCAL '!$C$11:$N$164,9,0)))","v":"2018-03-20"},{"$f":"IF(VLOOKUP($D$13&$C14,'PRECAMPAÑA FED-LOCAL '!$C$11:$N$164,10,0)=0,\"\",(VLOOKUP($D$13&$C14,'PRECAMPAÑA FED-LOCAL '!$C$11:$N$164,10,0)))","v":"2018-03-26"},{"$f":"IF(VLOOKUP($D$13&$C14,'PRECAMPAÑA FED-LOCAL '!$C$11:$N$164,11,0)=0,\"\",(VLOOKUP($D$13&$C14,'PRECAMPAÑA FED-LOCAL '!$C$11:$N$164,11,0)))","v":"2018-03-29"},{"$f":"IF(VLOOKUP($D$13&$C14,'PRECAMPAÑA FED-LOCAL '!$C$11:$N$164,12,0)=0,\"\",(VLOOKUP($D$13&$C14,'PRECAMPAÑA FED-LOCAL '!$C$11:$N$164,12,0)))","v":"2018-04-04"},null,null,null,"JALISCO"]
[null,null,null,null,"Días para la notificación:",null,null,{"$f":"IFERROR(VLOOKUP($D$13&$C$14&$E$15&$C$14,'PRECAMPAÑA FED-LOCAL '!$C$11:$N$164,6,0),\"\")","v":5},{"$f":"IFERROR(VLOOKUP($D$13&$C$14&$E$15&$C$14,'PRECAMPAÑA FED-LOCAL '!$C$11:$N$164,7,0),\"\")","v":15},{"$f":"IFERROR(VLOOKUP($D$13&$C$14&$E$15&$C$14,'PRECAMPAÑA FED-LOCAL '!$C$11:$N$164,8,0),\"\")","v":7},{"$f":"IFERROR(VLOOKUP($D$13&$C$14&$E$15&$C$14,'PRECAMPAÑA FED-LOCAL '!$C$11:$N$164,9,0),\"\")","v":10},{"$f":"IFERROR(VLOOKUP($D$13&$C$14&$E$15&$C$14,'PRECAMPAÑA FED-LOCAL '!$C$11:$N$164,10,0),\"\")","v":6},{"$f":"IFERROR(VLOOKUP($D$13&$C$14&$E$15&$C$14,'PRECAMPAÑA FED-LOCAL '!$C$11:$N$164,11,0),\"\")","v":3},{"$f":"IFERROR(VLOOKUP($D$13&$C$14&$E$15&$C$14,'PRECAMPAÑA FED-LOCAL '!$C$11:$N$164,12,0),\"\")","v":6},null,null,null,"MICHOACÁN"]
{"$rows_left_out":15}
{"sheet":"CAMPAÑA FED-LOCAL ","index":4,"n_rows":135,"n_cols":26,"rows_kept":135,"cut":false,"hidden":true,"merged":[[3,18,4,18],[132,3,132,5],[5,1,6,1],[5,3,6,3],[1,3,1,10],[1,12,1,16],[3,4,4,4],[3,5,4,5],[3,6,4,6],[9,1,129,1],[3,7,4,7],[3,8,4,8],[3,13,4,13]]}
[]
[null,null,null,"ETAPAS DEL PROCESO DE FISCALIZACIÓN 2017-2018",null,null,null,null,null,null,null,null,"CAMPAÑA"]
[]
[null,null,null,null,"INICIO CAMPAÑA","FIN CAMPAÑA","DIAS","INFORMES A PRESENTAR","DÍAS 1ER PERIODO","CONCLUSIÓN DEL PRIMER PERIODO","PRESENTACIÓN DEL PRIMER INFORME ","NOTIFICACIÓN DE ERRORES Y OMISIONES ","RESPUESTA AL OFICIO DE ERRORES Y OMISIONES ","DÍAS 2DO PERIODO","CONCLUSIÓN DEL SEGUNDO PERIODO","PRESENTACIÓN DEL SEGUNDO INFORME ","NOTIFICACIÓN DE ERRORES Y OMISIONES ","RESPUESTA AL OFICIO DE ERRORES Y OMISIONES ","DÍAS 3ER PERIODO","CONCLUSIÓN DEL TERCER PERIODO","PRESENTACIÓN DEL TERCER INFORME ","NOTIFICACIÓN DE ERRORES Y OMISIONES ","RESPUESTA AL OFICIO DE ERRORES Y OMISIONES ","PRESENTACIÓN  DE DICTAMEN ","APROBACIÓN DE LA COF ","APROBACIÓN DEL CONSEJO GENERAL"]
[null,null,null,null,null,null,null,null,null,"30 DIAS","3 DIAS","10 DIAS","5 DIAS",null,"30 DIAS","3 DIAS","10 DIAS","5 DIAS",null,"30 DIAS","3 DÍAS","10 DIAS","5 DIAS","10 DIAS","6 DIAS","6 DIAS"]
[null,"FEDERAL",null,"1 PRESIDENTE, \n300 DIPUTADOS, \n64 SENADORES.","2018-03-30","2018-06-27",90,3,30,"28 de abril de 2018","2018-05-01","2018-05-11","2018-05-16",30,"28 de mayo de 2018","2018-05-31","2018-06-10","2018-06-15",30,"27 de junio de 2018","2018-06-30","2018-07-10","2018-07-15","2018-07-25","2018-07-31","2018-08-06"]
[]
[]
[]
[null,"PROCESO ELECTORAL LOCAL",null,"AGUASCALIENTES"]
[null,null,"AGUASCALIENTES1","18 DIPUTADOS MR","2018-05-14","2018-06-27",45,1,null,null,null,null,null,30,"13 de junio de 2018","15 de junio de 2018","25 de junio de 2018","30 de junio de 2018",30,"2018-06-27","2018-06-30","2018-07-10","2018-07-15","2018-07-25","2018-07-31","2018-08-06"]
[]
[null,null,null,"BAJA CALIFORNIA SUR"]
[null,null,"BAJA CALIFORNIA SUR1","16 DIPUTADOS MR","2018-04-29","2018-06-27",60,2,null,null,null,null,null,30,"28 de mayo de 2018","31 de mayo de 2018","10 de junio de 2018","15 de junio de 2018",30,"2018-06-27","2018-06-30","2018-07-10","2018-07-15","2018-07-25","2018-07-31","2018-08-06"]
[null,null,"BAJA CALIFORNIA SUR2","5 AYUNTAMIENTOS","2018-04-29","2018-06-27",60,2,null,null,null,null,null,30,"28 de mayo de 2018","31 de mayo de 2018","10 de junio de 2018","15 de junio de 2018",30,"2018-06-27","2018-06-30","2018-07-10","2018-07-15","2018-07-25","2018-07-31","2018-08-06"]
{"$rows_left_out":121}
{"sheet":"CAMPAÑA","index":5,"n_rows":31,"n_cols":28,"rows_kept":31,"cut":false,"hidden":false,"merged":[[3,14,4,14],[3,19,4,19],[11,14,12,14],[11,19,12,19],[3,4,4,4],[3,5,4,5],[3,6,4,6],[3,7,4,7],[11,8,12,8],[11,9,12,9],[3,8,4,8],[3,9,4,9],[11,5,12,5],[11,6,12,6],[11,7,12,7]]}
[]
[1,null,null,null,"PROCESO DE FISCALIZACIÓN 2017 - 2018",null,null,null,null,null,null,null,"CAMPAÑA FEDERAL",null,null,null,null,null,null,null,null,null,null,null,null,null,null,"AGUASCALIENTES"]
[16,null,null,null,null,null,null,null,null,null,null,null,null,null,null,null,null,null,null,null,null,null,null,null,null,null,null,"BAJA CALIFORNIA SUR"]
[null,null,null,null,"CARGO","INICIO CAMPAÑA","FIN CAMPAÑA","DIAS","INFORMES A PRESENTAR","DÍAS 1ER PERIODO","CONCLUSIÓN DEL PRIMER PERIODO","PRESENTACIÓN DEL PRIMER INFORME ","NOTIFICACIÓN DE ERRORES Y OMISIONES ","RESPUESTA AL OFICIO DE ERRORES Y OMISIONES ","DÍAS 2DO PERIODO","CONCLUSIÓN DEL SEGUNDO PERIODO","PRESENTACIÓN DEL SEGUNDO INFORME ","NOTIFICACIÓN DE ERRORES Y OMISIONES ","RESPUESTA AL OFICIO DE ERRORES Y OMISIONES ","DÍAS 3ER PERIODO","CONCLUSIÓN DEL TERCER PERIODO","PRESENTACIÓN DEL TERCER INFORME ","NOTIFICACIÓN DE ERRORES Y OMISIONES ","RESPUESTA AL OFICIO DE ERRORES Y OMISIONES ","PRESENTACIÓN  DE DICTAMEN ","APROBACIÓN DE LA COF ","APROBACIÓN DEL CONSEJO GENERAL","CAMPECHE"]
[null,null,null,null,"CARGO Y GRUPO",null,null,null,null,null,"30 DIAS","3 DIAS","10 DIAS","5 DIAS",null,"30 DIAS","3 DIAS","10 DIAS","5 DIAS",null,"30 DIAS","3 DÍAS","10 DIAS","5 DIAS","10 DIAS","6 DIAS","6 DIAS","CHIAPAS"]
[null,"FEDERAL",null,null,"1 PRESIDENTE, \n300 DIPUTADOS, \n64 SENADORES.","2018-03-30","2018-06-27",90,3,30,"28 de abril de 2018","2018-05-01","2018-05-11","2018-05-16",30,"28 de mayo de 2018","2018-05-31","2018-06-10","2018-06-15",30,"27 de junio de 2018","2018-06-30","2018-07-10","2018-07-15","2018-07-25","2018-07-31","2018-08-06","CHIHUAHUA"]
[null,null,null,null,null,null,null,null,null,null,null,null,null,null,null,null,null,null,null,null,null,null,null,null,null,null,null,"CIUDAD DE MÉXICO"]
[null,null,null,null,null,null,null,null,null,null,null,null,null,null,null,null,null,null,null,null,null,null,null,null,null,null,null,"COAHUILA"]
[null,null,null,null,null,null,null,null,null,null,null,null,null,null,null,null,null,null,null,null,null,null,null,null,null,null,null,"COLIMA"]
[null,null,null,null,"PROCESO DE FISCALIZACIÓN 2017 - 2018",null,null,null,null,null,null,null,"CAMPAÑA LOCAL",null,null,null,null,null,null,null,null,null,null,null,null,null,null,"DURANGO"]
[null,null,null,null,null,null,null,null,null,null,null,null,null,null,null,null,null,null,null,null,null,null,null,null,null,null,null,"ESTADO DE MÉXICO"]
[null,null,null,null,"ENTIDAD","INICIO CAMPAÑA","FIN CAMPAÑA","DIAS","INFORMES A PRESENTAR","DÍAS 1ER PERIODO","CONCLUSIÓN DEL PRIMER PERIODO","PRESENTACIÓN DEL PRIMER INFORME ","NOTIFICACIÓN DE ERRORES Y OMISIONES ","RESPUESTA AL OFICIO DE ERRORES Y OMISIONES ","DÍAS 2DO PERIODO","CONCLUSIÓN DEL SEGUNDO PERIODO","PRESENTACIÓN DEL SEGUNDO INFORME ","NOTIFICACIÓN DE ERRORES Y OMISIONES ","RESPUESTA AL OFICIO DE ERRORES Y OMISIONES ","DÍAS 3ER PERIODO","CONCLUSIÓN DEL TERCER PERIODO","PRESENTACIÓN DEL TERCER INFORME ","NOTIFICACIÓN DE ERRORES Y OMISIONES ","RESPUESTA AL OFICIO DE ERRORES Y OMISIONES ","PRESENTACIÓN  DE DICTAMEN ","APROBACIÓN DE LA COF ","APROBACIÓN DEL CONSEJO GENERAL","GUANAJUATO"]
[null,"PROCESO ELECTORAL LOCAL",null,null,"QUINTANA ROO",null,null,null,null,null,"30 DIAS","3 DIAS","10 DIAS","5 DIAS",null,"30 DIAS","3 DIAS","10 DIAS","5 DIAS",null,"30 DIAS","3 DÍAS","10 DIAS","5 DIAS","10 DIAS","6 DIAS","6 DIAS","GUERRERO"]
[null,"3-21 DIPUTADOS MR",null,1,{"$f":"IFERROR(VLOOKUP($E$13&$D$14,'CAMPAÑA FED-LOCAL '!$C$11:$G$130,2,0),\"\")","v":"11 AYUNTAMIENTOS"},{"$f":"IFERROR(VLOOKUP($E$13&$D$14,'CAMPAÑA FED-LOCAL '!$C$11:$G$130,3,0),\"\")","v":"2018-05-14"},{"$f":"IFERROR(VLOOKUP($E$13&$D$14,'CAMPAÑA FED-LOCAL '!$C$11:$G$130,4,0),\"\")","v":"2018-06-27"},{"$f":"IFERROR(VLOOKUP($E$13&$D$14,'CAMPAÑA FED-LOCAL '!$C$11:$Z$140,5,0),\"\")","v":45},{"$f":"IFERROR(VLOOKUP($E$13&$D$14,'CAMPAÑA FED-LOCAL '!$C$11:$Z$140,6,0),\"\")","v":1},{"$f":"IF(IFERROR(VLOOKUP($E$13&$D$14,'CAMPAÑA FED-LOCAL '!$C$11:$Z$130,7,0),\"\")=0,\"\",IFERROR(VLOOKUP($E$13&$D$14,'CAMPAÑA FED-LOCAL '!$C$11:$Z$130,7,0),\"\"))","v":""},{"$f":"IF(IFERROR(VLOOKUP($E$13&$D$14,'CAMPAÑA FED-LOCAL '!$C$11:$Z$130,8,0),\"\")=0,\"\",VLOOKUP($E$13&$D$14,'CAMPAÑA FED-LOCAL '!$C$11:$Z$130,8,0))","v":""},{"$f":"IF(IFERROR(VLOOKUP($E$13&$D$14,'CAMPAÑA FED-LOCAL '!$C$11:$Z$130,9,0),\"\")=0,\"\",VLOOKUP($E$13&$D$14,'CAMPAÑA FED-LOCAL '!$C$11:$Z$130,9,0))","v":""},{"$f":"IF(IFERROR(VLOOKUP($E$13&$D$14,'CAMPAÑA FED-LOCAL '!$C$11:$Z$130,10,0),\"\")=0,\"\",VLOOKUP($E$13&$D$14,'CAMPAÑA FED-LOCAL '!$C$11:$Z$130,10,0))","v":""},{"$f":"IF(IFERROR(VLOOKUP($E$13&$D$14,'CAMPAÑA FED-LOCAL '!$C$11:$Z$130,11,0),\"\")=0,\"\",VLOOKUP($E$13&$D$14,'CAMPAÑA FED-LOCAL '!$C$11:$Z$130,11,0))","v":""},{"$f":"IF(IFERROR(VLOOKUP($E$13&$D$14,'CAMPAÑA FED-LOCAL '!$C$11:$Z$130,12,0),\"\")=0,\"\",IFERROR(VLOOKUP($E$13&$D$14,'CAMPAÑA FED-LOCAL '!$C$11:$Z$130,12,0),\"\"))","v":""},{"$f":"IF(IFERROR(VLOOKUP($E$13&$D$14,'CAMPAÑA FED-LOCAL '!$C$11:$Z$130,13,0),\"\")=0,\"\",IFERROR(VLOOKUP($E$13&$D$14,'CAMPAÑA FED-LOCAL '!$C$11:$Z$130,13,0),\"\"))","v":""},{"$f":"IF(IFERROR(VLOOKUP($E$13&$D$14,'CAMPAÑA FED-LOCAL '!$C$11:$Z$130,14,0),\"\")=0,\"\",IFERROR(VLOOKUP($E$13&$D$14,'CAMPAÑA FED-LOCAL '!$C$11:$Z$130,14,0),\"\"))","v":""},{"$f":"IF(IFERROR(VLOOKUP($E$13&$D$14,'CAMPAÑA FED-LOCAL '!$C$11:$Z$130,15,0),\"\")=0,\"\",IFERROR(VLOOKUP($E$13&$D$14,'CAMPAÑA FED-LOCAL '!$C$11:$Z$130,15,0),\"\"))","v":""},{"$f":"IF(IFERROR(VLOOKUP($E$13&$D$14,'CAMPAÑA FED-LOCAL '!$C$11:$Z$130,16,0),\"\")=0,\"\",IFERROR(VLOOKUP($E$13&$D$14,'CAMPAÑA FED-LOCAL '!$C$11:$Z$130,16,0),\"\"))","v":""},{"$f":"IFERROR(IF(VLOOKUP($E$13&$D$14,'CAMPAÑA FED-LOCAL '!$C$11:$Z$130,17,0)=0,\"\",VLOOKUP($E$13&$D$14,'CAMPAÑA FED-LOCAL '!$C$11:$Z$130,17,0)),\"\")","v":45},{"$f":"IF(IFERROR(VLOOKUP($E$13&$D$14,'CAMPAÑA FED-LOCAL '!$C$11:$Z$130,18,0),\"\")=0,\"\",VLOOKUP($E$13&$D$14,'CAMPAÑA FED-LOCAL '!$C$11:$Z$130,18,0))","v":"2018-06-27"},{"$f":"IF(IFERROR(VLOOKUP($E$13&$D$14,'CAMPAÑA FED-LOCAL '!$C$11:$Z$130,19,0),\"\")=0,\"\",VLOOKUP($E$13&$D$14,'CAMPAÑA FED-LOCAL '!$C$11:$Z$130,19,0))","v":"2018-06-30"},{"$f":"IF(IFERROR(VLOOKUP($E$13&$D$14,'CAMPAÑA FED-LOCAL '!$C$11:$Z$130,20,0),\"\")=0,\"\",VLOOKUP($E$13&$D$14,'CAMPAÑA FED-LOCAL '!$C$11:$Z$130,20,0))","v":"2018-07-10"},{"$f":"IF(IFERROR(VLOOKUP($E$13&$D$14,'CAMPAÑA FED-LOCAL '!$C$11:$Z$130,21,0),\"\")=0,\"\",VLOOKUP($E$13&$D$14,'CAMPAÑA FED-LOCAL '!$C$11:$Z$130,21,0))","v":"2018-07-15"},{"$f":"IF(IFERROR(VLOOKUP($E$13&$D$14,'CAMPAÑA FED-LOCAL '!$C$11:$Z$130,22,0),\"\")=0,\"\",VLOOKUP($E$13&$D$14,'CAMPAÑA FED-LOCAL '!$C$11:$Z$130,22,0))","v":"2018-07-25"},{"$f":"IF(IFERROR(VLOOKUP($E$13&$D$14,'CAMPAÑA FED-LOCAL '!$C$11:$Z$130,23,0),\"\")=0,\"\",VLOOKUP($E$13&$D$14,'CAMPAÑA FED-LOCAL '!$C$11:$Z$130,23,0))","v":"2018-07-31"},{"$f":"IF(IFERROR(VLOOKUP($E$13&$D$14,'CAMPAÑA FED-LOCAL '!$C$11:$Z$130,24,0),\"\")=0,\"\",VLOOKUP($E$13&$D$14,'CAMPAÑA FED-LOCAL '!$C$11:$Z$130,24,0))","v":"2018-08-06"},"HIDALGO"]
[null,null,null,null,null,null,null,null,"}",null,null,null,null,null,null,null,null,null,null,null,null,null,null,null,null,null,null,"JALISCO"]
{"$rows_left_out":16}